[Ros-cis] [18204] ReactOS Publish Error

ros-cis at reactos.com ros-cis at reactos.com
Sun Oct 2 11:25:16 CEST 2005


make bootcd failed: (error: In file included from
include/ndk/psfuncs.h:13, from include/ndk/ntndk.h:34, from
boot/freeldr/freeldr/include/freeldr.h:24, from
boot\freeldr\freeldr\cache\cache.c:21: include/ndk/pstypes.h:627: error:
syntax error before "PHANDLE_TABLE" include/ndk/pstypes.h:627: warning:
no semicolon at end of struct or union include/ndk/pstypes.h:628:
warning: type defaults to `int' in declaration of `Token'
include/ndk/pstypes.h:628: warning: data definition has no type or
storage class include/ndk/pstypes.h:655: warning: unnamed struct/union
that defines no instances include/ndk/pstypes.h:668: error: syntax error
before "PrefetchTrace" include/ndk/pstypes.h:668: warning: type defaults
to `int' in declaration of `PrefetchTrace' include/ndk/pstypes.h:668:
warning: data definition has no type or storage class
include/ndk/pstypes.h:718: warning: unnamed struct/union that defines no
instances include/ndk/pstypes.h:730: warning: unnamed struct/union that
defines no instances include/ndk/pstypes.h:745: error: syntax error
before '}' token include/ndk/pstypes.h:745: warning: type defaults to
`int' in declaration of `EPROCESS' include/ndk/pstypes.h:745: warning:
data definition has no type or storage class In file included from
include/ndk/psfuncs.h:13, from include/ndk/ntndk.h:34, from
boot/freeldr/freeldr/include/freeldr.h:24, from
boot\freeldr\freeldr\disk\disk.c:20: include/ndk/pstypes.h:627: error:
syntax error before "PHANDLE_TABLE" include/ndk/pstypes.h:627: warning:
no semicolon at end of struct or union include/ndk/pstypes.h:628:
warning: type defaults to `int' in declaration of `Token'
include/ndk/pstypes.h:628: warning: data definition has no type or
storage class include/ndk/pstypes.h:655: warning: unnamed struct/union
that defines no instances include/ndk/pstypes.h:668: error: syntax error
before "PrefetchTrace" include/ndk/pstypes.h:668: warning: type defaults
to `int' in declaration of `PrefetchTrace' include/ndk/pstypes.h:668:
warning: data definition has no type or storage class
include/ndk/pstypes.h:718: warning: unnamed struct/union that defines no
instances include/ndk/pstypes.h:730: warning: unnamed struct/union that
defines no instances include/ndk/pstypes.h:745: error: syntax error
before '}' token include/ndk/pstypes.h:745: warning: type defaults to
`int' in declaration of `EPROCESS' include/ndk/pstypes.h:745: warning:
data definition has no type or storage class In file included from
include/ndk/psfuncs.h:13, from include/ndk/ntndk.h:34, from
boot/freeldr/freeldr/include/freeldr.h:24, from
boot\freeldr\freeldr\comm\rs232.c:22: include/ndk/pstypes.h:627: error:
syntax error before "PHANDLE_TABLE" include/ndk/pstypes.h:627: warning:
no semicolon at end of struct or union include/ndk/pstypes.h:628:
warning: type defaults to `int' in declaration of `Token'
include/ndk/pstypes.h:628: warning: data definition has no type or
storage class In file included from include/ndk/psfuncs.h:13, from
include/ndk/ntndk.h:34, from boot/freeldr/freeldr/include/freeldr.h:24,
from boot\freeldr\freeldr\cache\blocklist.c:21:
include/ndk/pstypes.h:627: error: syntax error before "PHANDLE_TABLE"
include/ndk/pstypes.h:627: warning: no semicolon at end of struct or
union include/ndk/pstypes.h:628: warning: type defaults to `int' in
declaration of `Token' include/ndk/pstypes.h:628: warning: data
definition has no type or storage class include/ndk/pstypes.h:655:
warning: unnamed struct/union that defines no instances
include/ndk/pstypes.h:655: warning: unnamed struct/union that defines no
instances include/ndk/pstypes.h:668: error: syntax error before
"PrefetchTrace" include/ndk/pstypes.h:668: warning: type defaults to
`int' in declaration of `PrefetchTrace' include/ndk/pstypes.h:668:
warning: data definition has no type or storage class
include/ndk/pstypes.h:668: error: syntax error before "PrefetchTrace"
include/ndk/pstypes.h:668: warning: type defaults to `int' in
declaration of `PrefetchTrace' include/ndk/pstypes.h:668: warning: data
definition has no type or storage class include/ndk/pstypes.h:718:
warning: unnamed struct/union that defines no instances
include/ndk/pstypes.h:718: warning: unnamed struct/union that defines no
instances include/ndk/pstypes.h:730: warning: unnamed struct/union that
defines no instances include/ndk/pstypes.h:745: error: syntax error
before '}' token include/ndk/pstypes.h:730: warning: unnamed
struct/union that defines no instances include/ndk/pstypes.h:745:
warning: type defaults to `int' in declaration of `EPROCESS'
include/ndk/pstypes.h:745: warning: data definition has no type or
storage class include/ndk/pstypes.h:745: error: syntax error before '}'
token include/ndk/pstypes.h:745: warning: type defaults to `int' in
declaration of `EPROCESS' include/ndk/pstypes.h:745: warning: data
definition has no type or storage class mingw32-make: ***
[obj-i386\boot\freeldr\freeldr\cache\cache.o] Error 1 mingw32-make: ***
Waiting for unfinished jobs.... mingw32-make: ***
[obj-i386\boot\freeldr\freeldr\disk\disk.o] Error 1 mingw32-make: ***
[obj-i386\boot\freeldr\freeldr\comm\rs232.o] Error 1 ) Reading build
files...done Detecting compiler...detected (gcc) Detecting
binutils...detected (ld) Detecting netwide assembler...detected (nasm)
Detecting compiler -pipe support...detected Detecting compiler
pre-compiled header support...detected Processing modules...done
Creating directories...done Unpacking WINE resources...done Generating
test support code...done Generating proxy makefiles...done Checking
automatic dependencies...done 

-------------- next part --------------
An HTML attachment was scrubbed...
URL: http://www.reactos.org/pipermail/ros-cis/attachments/20051002/a8d7e6cf/attachment.html


More information about the Ros-cis mailing list