[Ros-cis] [18659] ReactOS Publish Error

ros-cis at reactos.com ros-cis at reactos.com
Sat Oct 22 18:37:07 CEST 2005


make bootcd failed: (error: apps\utils\net\ftp\ftp.c:265: warning:
'cmdabort' defined but not used {standard input}: Assembler messages:
{standard input}:1965: Warning: Ignoring changed section attributes for
.text {standard input}: Assembler messages: {standard input}:1966:
Warning: Ignoring changed section attributes for .text {standard input}:
Assembler messages: {standard input}:1610: Warning: Ignoring changed
section attributes for .text {standard input}: Assembler messages:
{standard input}:1985: Warning: Ignoring changed section attributes for
.text {standard input}: Assembler messages: {standard input}:1611:
Warning: Ignoring changed section attributes for .text {standard input}:
Assembler messages: {standard input}:1640: Warning: Ignoring changed
section attributes for .text {standard input}: Assembler messages:
{standard input}:3704: Warning: Ignoring changed section attributes for
.text lib\dbghelp\stack.c: In function `StackWalk':
lib\dbghelp\stack.c:113: warning: unused variable `info' {standard
input}: Assembler messages: {standard input}:4318: Warning: Ignoring
changed section attributes for .text {standard input}: Assembler
messages: {standard input}:4318: Warning: Ignoring changed section
attributes for .text lib\dsound\capture.c: In function
`DirectSoundCaptureEnumerateA': lib\dsound\capture.c:311: warning:
implicit declaration of function `RosWineWaveInMessage'
lib\dsound\dsound.c: In function `IDirectSoundImpl_Initialize':
lib\dsound\dsound.c:714: warning: implicit declaration of function
`RosWineWaveOutMessage' lib\dsound\dsound_main.c: In function
`DirectSoundEnumerateA': lib\dsound\dsound_main.c:321: warning: implicit
declaration of function `RosWineWaveOutMessage' lib\dsound\propset.c: In
function `DSPROPERTY_Description1': lib\dsound\propset.c:446: warning:
implicit declaration of function `RosWineWaveOutMessage'
lib\dsound\propset.c:477: warning: implicit declaration of function
`RosWineWaveInMessage' lib\dsound\dxroslayer\dxroslayer.c: In function
`RosWineWaveOutMessage': lib\dsound\dxroslayer\dxroslayer.c:84: warning:
implicit declaration of function `dxrosdrv_drv_querydsounddescss'
lib\dsound\dxroslayer\dxroslayer.c:88: warning: passing arg 2 of
`dxrosdrv_drv_querydsoundiface' from incompatible pointer type
lib\dsound\dxroslayer\dxroslayer.c: In function `RosWineWaveInMessage':
lib\dsound\dxroslayer\dxroslayer.c:107: warning: passing arg 2 of
`dxrosdrv_drv_querydsoundiface' from incompatible pointer type {standard
input}: Assembler messages: {standard input}:3276: Warning: Ignoring
changed section attributes for .text
lib\freetype\src\base\ftglyph.c:329: warning: initialization from
incompatible pointer type In file included from
w32api/include/ddk/winddi.h:34, from lib\gdi32\include\precomp.h:18:
w32api/include/ddk/ddrawint.h:674: error: syntax error before
"LPDDVIDEOPORTDESC" w32api/include/ddk/ddrawint.h:677: error: syntax
error before '}' token w32api/include/ddk/ddrawint.h:683: error: syntax
error before "LPDDVIDEOPORTDESC" w32api/include/ddk/ddrawint.h:687:
error: syntax error before '}' token w32api/include/ddk/ddrawint.h:709:
error: syntax error before "LPDDVIDEOPORTBANDWIDTH"
w32api/include/ddk/ddrawint.h:712: error: syntax error before '}' token
w32api/include/ddk/ddrawint.h:764: error: syntax error before
"LPDDVIDEOPORTCONNECT" w32api/include/ddk/ddrawint.h:768: error: syntax
error before '}' token w32api/include/ddk/ddrawint.h:797: error: syntax
error before "LPDDVIDEOPORTINFO" w32api/include/ddk/ddrawint.h:803:
error: syntax error before '}' token In file included from
lib\gdi32\include\precomp.h:18: w32api/include/ddk/winddi.h:2524: error:
syntax error before "LPSURFACEALIGNMENT" mingw32-make: ***
[obj-i386\lib\gdi32\include\precomp.h.gch] Error 1 mingw32-make: ***
Waiting for unfinished jobs.... ) Reading build files...done Detecting
compiler...detected (gcc) Detecting binutils...detected (ld) Detecting
netwide assembler...detected (nasm) Detecting compiler -pipe
support...detected Detecting compiler pre-compiled header
support...detected Processing modules...done Creating directories...done
Unpacking WINE resources...done Generating test support code...done
Generating proxy makefiles...done Checking automatic dependencies...done
-------------- next part --------------
An HTML attachment was scrubbed...
URL: http://www.reactos.org/pipermail/ros-cis/attachments/20051022/124a1099/attachment.html


More information about the Ros-cis mailing list