[ros-dev] Unable to compile; infcore error

Evans Jahja evans.jahja at yahoo.com
Mon Jan 4 17:04:53 CET 2010


Hi,

I'm trying to compile React OS, however I encountered this error when I'm trying to compile:


[HOST-CC]  lib/inflib/infcore.c
lib/inflib/infcore.c: In function `InfpAddSection':
lib/inflib/infcore.c:184: warning: implicit declaration of function `__builtin_offsetof'
lib/inflib/infcore.c:184: error: parse error before "INFCACHESECTION"
lib/inflib/infcore.c:184: error: parse error before ']' token
lib/inflib/infcore.c: In function `InfpAddFieldToLine':
lib/inflib/infcore.c:289: error: parse error before "INFCACHEFIELD"
lib/inflib/infcore.c:289: error: parse error before ']' token
make: *** No rule to make target `makefile.auto', needed by `all'.  Stop.

Please help me, thanks.

Evans



      Get your new Email address!
Grab the Email name you've always wanted before someone else does!
http://mail.promotions.yahoo.com/newdomains/aa/
-------------- next part --------------
An HTML attachment was scrubbed...
URL: http://www.reactos.org/pipermail/ros-dev/attachments/20100104/0dca8c39/attachment.htm 


More information about the Ros-dev mailing list